Reaction Details
TargetGag-Pol polyprotein [489-587]
LigandBDBM50127971
Substrate/Competitorn/a
Meas. Tech.ChEMBL_159452 (CHEMBL766797)
IC50 7.90±n/a nM
Citation Lu, ZRaghavan, SBohn, JCharest, MStahlhut, MWRutkowski, CASimcoe, ALOlsen, DBSchleif, WACarella, AGabryelski, LJin, LLin, JHEmini, EChapman, KTata, JR Design and synthesis of highly potent HIV protease inhibitors with activity against resistant virus. Bioorg Med Chem Lett13:1821-4 (2003) Gag-Pol polyprotein [489-587]
Name:Gag-Pol polyprotein [489-587]
Type:Enzyme Subunit
Mol. Mass.:10781.16
Organism:Human immunodeficiency virus type 1
Description:P04585[489-587]
Residue:99
BDBM50127971
NameBDBM50127971
Synonyms:(R)-3-[(2S,4R)-2-Hydroxy-4-((3S,4S)-3-hydroxy-chroman-4-ylcarbamoyl)-5-phenyl-pentyl]-5,5-dimethyl-thiazolidine-4-carboxylic acid 2-methyl-benzylamide | CHEMBL54182
TypeSmall organic molecule
Emp. Form.C35H43N3O5S
Mol. Mass.617.798
SMILESCc1ccccc1CNC(=O)[C@H]1N(C[C@@H](O)C[C@@H](Cc2ccccc2)C(=O)N[C@@H]2[C@H](O)COc3ccccc23)CSC1(C)C