Reaction Details
TargetAcetylcholinesterase
LigandBDBM50127979
Substrate/Competitorn/a
Meas. Tech.ChEBML_27794
IC50 33±n/a nM
Citation Trujillo-Ferrara, JMontoya Cano, LEspinoza-Fonseca, M Synthesis, anticholinesterase activity and structure-activity relationships of m-Aminobenzoic acid derivatives. Bioorg Med Chem Lett13:1825-7 (2003) Acetylcholinesterase
Name:Acetylcholinesterase
Type:n/a
Mol. Mass.:65900.74
Organism:Tetronarce californica (Pacific electric ray) (Torpedo californica)
Description:P04058
Residue:586
BDBM50127979
NameBDBM50127979
Synonyms:3-(2,5-Dioxo-pyrrolidin-1-yl)-benzoic acid | CHEMBL52722
TypeSmall organic molecule
Emp. Form.C11H9NO4
Mol. Mass.219.1935
SMILESOC(=O)c1cccc(c1)-n1c(O)ccc1O