Reaction Details
TargetLanosterol synthase
LigandBDBM50128050
Substrate/Competitorn/a
Meas. Tech.ChEMBL_148897 (CHEMBL754981)
IC50 5.4±n/a nM
Citation Lenhart, AReinert, DJAebi, JDDehmlow, HMorand, OHSchulz, GE Binding structures and potencies of oxidosqualene cyclase inhibitors with the homologous squalene-hopene cyclase. J Med Chem46:2083-92 (2003) 
 
Lanosterol synthase
Name:Lanosterol synthase
Type:PROTEIN
Mol. Mass.:83309.32
Organism:Homo sapiens (Human)
Description:ChEMBL_11231
Residue:732
BDBM50128050
NameBDBM50128050
Synonyms:CHEMBL114259 N-allyl-6-(4-(4-bromobenzoyl)phenoxy)-N-methylhexan-1-aminium | {4-[6-(Allyl-methyl-amino)-hexyloxy]-phenyl}-(4-bromo-phenyl)-methanone
TypeSmall organic molecule
Emp. Form.C23H28BrNO2
Mol. Mass.430.378
SMILESCN(CCCCCCOc1ccc(cc1)C(=O)c1ccc(Br)cc1)CC=C