Reaction Details
TargetCholesteryl ester transfer protein
LigandBDBM50128156
Substrate/Competitorn/a
Meas. Tech.ChEMBL_216899 (CHEMBL815632)
IC50 80±n/a nM
Citation Reinhard, EJWang, JLDurley, RCFobian, YMGrapperhaus, MLHickory, BSMassa, MANorton, MBPromo, MATollefson, MBVernier, WFConnolly, DTWitherbee, BJMelton, MARegina, KJSmith, MESikorski, JA Discovery of a simple picomolar inhibitor of cholesteryl ester transfer protein. J Med Chem46:2152-68 (2003) 
 
Cholesteryl ester transfer protein
Name:Cholesteryl ester transfer protein
Type:Enzyme
Mol. Mass.:54751.53
Organism:Homo sapiens (Human)
Description:P11597
Residue:493
BDBM50128156
NameBDBM50128156
Synonyms:3-((3-(3,4-dichlorophenoxy)phenyl)(3-(1,1,2,2-tetrafluoroethoxy)benzyl)amino)-1,1,1-trifluoropropan-2-ol CHEMBL302352
TypeSmall organic molecule
Emp. Form.C24H18Cl2F7NO3
Mol. Mass.572.299
SMILESOC(CN(Cc1cccc(OC(F)(F)C(F)F)c1)c1cccc(Oc2ccc(Cl)c(Cl)c2)c1)C(F)(F)F