Reaction Details
TargetCholesteryl ester transfer protein
LigandBDBM50128169
Substrate/Competitorn/a
Meas. Tech.ChEMBL_216899 (CHEMBL815632)
IC50 80±n/a nM
Citation Reinhard, EJWang, JLDurley, RCFobian, YMGrapperhaus, MLHickory, BSMassa, MANorton, MBPromo, MATollefson, MBVernier, WFConnolly, DTWitherbee, BJMelton, MARegina, KJSmith, MESikorski, JA Discovery of a simple picomolar inhibitor of cholesteryl ester transfer protein. J Med Chem46:2152-68 (2003) 
 
Cholesteryl ester transfer protein
Name:Cholesteryl ester transfer protein
Type:Enzyme
Mol. Mass.:54751.53
Organism:Homo sapiens (Human)
Description:P11597
Residue:493
BDBM50128169
NameBDBM50128169
Synonyms:1,1,1-Trifluoro-3-{[3-(4-fluoro-3-methyl-phenoxy)-phenyl]-[3-(1,1,2,2-tetrafluoro-ethoxy)-benzyl]-amino}-propan-2-ol 3-((3-(1,1,2,2-tetrafluoroethoxy)benzyl)(3-(4-fluoro-3-methylphenoxy)phenyl)amino)-1,1,1-trifluoropropan-2-ol | CHEMBL69885
TypeSmall organic molecule
Emp. Form.C25H21F8NO3
Mol. Mass.535.4264
SMILESCc1cc(Oc2cccc(c2)N(CC(O)C(F)(F)F)Cc2cccc(OC(F)(F)C(F)F)c2)ccc1F