Reaction Details
TargetCholesteryl ester transfer protein
LigandBDBM50128155
Substrate/Competitorn/a
Meas. Tech.ChEMBL_216899 (CHEMBL815632)
IC50 200±n/a nM
Citation Reinhard, EJWang, JLDurley, RCFobian, YMGrapperhaus, MLHickory, BSMassa, MANorton, MBPromo, MATollefson, MBVernier, WFConnolly, DTWitherbee, BJMelton, MARegina, KJSmith, MESikorski, JA Discovery of a simple picomolar inhibitor of cholesteryl ester transfer protein. J Med Chem46:2152-68 (2003) 
 
Cholesteryl ester transfer protein
Name:Cholesteryl ester transfer protein
Type:Enzyme
Mol. Mass.:54751.53
Organism:Homo sapiens (Human)
Description:P11597
Residue:493
BDBM50128155
NameBDBM50128155
Synonyms:1,1,1-Trifluoro-3-{[3-(4-propyl-phenoxy)-phenyl]-[3-(1,1,2,2-tetrafluoro-ethoxy)-benzyl]-amino}-propan-2-ol CHEMBL67918
TypeSmall organic molecule
Emp. Form.C27H26F7NO3
Mol. Mass.545.4891
SMILESCCCc1ccc(Oc2cccc(c2)N(CC(O)C(F)(F)F)Cc2cccc(OC(F)(F)C(F)F)c2)cc1