Reaction Details
TargetCholesteryl ester transfer protein
LigandBDBM50128182
Substrate/Competitorn/a
Meas. Tech.ChEMBL_216899 (CHEMBL815632)
IC50 300±n/a nM
Citation Reinhard, EJWang, JLDurley, RCFobian, YMGrapperhaus, MLHickory, BSMassa, MANorton, MBPromo, MATollefson, MBVernier, WFConnolly, DTWitherbee, BJMelton, MARegina, KJSmith, MESikorski, JA Discovery of a simple picomolar inhibitor of cholesteryl ester transfer protein. J Med Chem46:2152-68 (2003) 
 
Cholesteryl ester transfer protein
Name:Cholesteryl ester transfer protein
Type:Enzyme
Mol. Mass.:54751.53
Organism:Homo sapiens (Human)
Description:P11597
Residue:493
BDBM50128182
NameBDBM50128182
Synonyms:1,1,1-Trifluoro-3-{[3-(3-fluoro-phenoxy)-phenyl]-[3-(1,1,2,2-tetrafluoro-ethoxy)-benzyl]-amino}-propan-2-ol 3-((3-(1,1,2,2-tetrafluoroethoxy)benzyl)(3-(3-fluorophenoxy)phenyl)amino)-1,1,1-trifluoropropan-2-ol | CHEMBL68805
TypeSmall organic molecule
Emp. Form.C24H19F8NO3
Mol. Mass.521.3998
SMILESOC(CN(Cc1cccc(OC(F)(F)C(F)F)c1)c1cccc(Oc2cccc(F)c2)c1)C(F)(F)F