Reaction Details
TargetGlutamate receptor 1
LigandBDBM50002370
Substrate/Competitorn/a
Meas. Tech.ChEMBL_90149 (CHEMBL701247)
Ki 22±n/a nM
Citation Bjerrum, EJKristensen, ASPickering, DSGreenwood, JRNielsen, BLiljefors, TSchousboe, ABräuner-Osborne, HMadsen, U Design, synthesis, and pharmacology of a highly subtype-selective GluR1/2 agonist, (RS)-2-amino-3-(4-chloro-3-hydroxy-5-isoxazolyl)propionic acid (Cl-HIBO). J Med Chem46:2246-9 (2003) 
 
Glutamate receptor 1
Name:Glutamate receptor 1
Type:Enzyme Catalytic Domain
Mol. Mass.:101512.92
Organism:Homo sapiens (Human)
Description:Glutamate AMPA 1 GRIA1 HUMAN::P42261
Residue:906
BDBM50002370
NameBDBM50002370
Synonyms:(R,S)-alpha-amino-3-hydroxy-5-methyl-4-isooxazole-propionic acid 2-Amino-3-(3-hydroxy-5-methyl-isoxazol-4-yl)-propionic acid 2-amino-3-(3-hydroxy-5-methyl-4-isoxazolyl)-propionic acid 2-ammonio-3-(3-hydroxy-5-methylisoxazol-4-yl)propanoate CHEMBL13378
TypeSmall organic molecule
Emp. Form.C7H10N2O4
Mol. Mass.186.1653
SMILESCc1o[nH]c(=O)c1CC(N)C(O)=O