Reaction Details
TargetEstrogen receptor beta
LigandBDBM50128402
Substrate/Competitorn/a
Meas. Tech.ChEBML_67825
Ki 3.2±n/a nM
Citation Wallace, OBLauwers, KSJones, SADodge, JA Tetrahydroquinoline-based selective estrogen receptor modulators (SERMs). Bioorg Med Chem Lett13:1907-10 (2003) Estrogen receptor beta
Name:Estrogen receptor beta
Type:Protein
Mol. Mass.:59238.43
Organism:Homo sapiens (Human)
Description:Q92731
Residue:530
BDBM50128402
NameBDBM50128402
Synonyms:2-(4-Hydroxy-phenyl)-1-[4-(2-pyrrolidin-1-yl-ethoxy)-phenyl]-1,2,3,4-tetrahydro-quinolin-6-ol | CHEMBL56390
TypeSmall organic molecule
Emp. Form.C27H30N2O3
Mol. Mass.430.5387
SMILESOc1ccc(cc1)C1CCc2cc(O)ccc2N1c1ccc(OCCN2CCCC2)cc1