Reaction Details
TargetKappa-type opioid receptor
LigandBDBM50128411
Substrate/Competitorn/a
Meas. Tech.ChEBML_146513
Ki 22±n/a nM
Citation Wentland, MPSun, XYe, YLou, RBidlack, JM Redefining the structure-activity relationships of 2,6-methano-3-benzazocines. Part 2: 8-formamidocyclazocine analogues. Bioorg Med Chem Lett13:1911-4 (2003) Kappa-type opioid receptor
Name:Kappa-type opioid receptor
Type:G Protein-Coupled Receptor (GPCR)
Mol. Mass.:42744.99
Organism:Cavia porcellus (domestic guinea pig)
Description:P41144
Residue:380
BDBM50128411
NameBDBM50128411
Synonyms:3-desoxy-3-carboxamidonaltrexone CHEMBL56695
TypeSmall organic molecule
Emp. Form.C21H24N2O4
Mol. Mass.368.4263
SMILESNC(=O)c1ccc2C[C@H]3N(CC4CC4)CC[C@@]45[C@@H](Oc1c24)C(=O)CC[C@@]35O