Reaction Details
TargetcAMP-specific 3',5'-cyclic phosphodiesterase 4A
LigandBDBM50064858
Substrate/Competitorn/a
Meas. Tech.ChEMBL_155719 (CHEMBL760597)
IC50 4±n/a nM
Citation Ducharme, YFriesen, RWBlouin, MCôté, BDubé, DEthier, DFrenette, RLaliberté, FMancini, JAMasson, PStyhler, AYoung, RNGirard, Y Substituted 2-pyridinemethanol derivatives as potent and selective phosphodiesterase-4 inhibitors. Bioorg Med Chem Lett13:1923-6 (2003) cAMP-specific 3',5'-cyclic phosphodiesterase 4A
Name:cAMP-specific 3',5'-cyclic phosphodiesterase 4A
Type:Enzyme
Mol. Mass.:98113.27
Organism:Homo sapiens (Human)
Description:P27815
Residue:886
BDBM50064858
NameBDBM50064858
Synonyms:(R)-4-(2-(3-(cyclopentyloxy)-4-methoxyphenyl)-2-phenylethyl)pyridine 4-[2-(3-Cyclopentyloxy-4-methoxy-phenyl)-2-phenyl-ethyl]-pyridine | CHEMBL32442
TypeSmall organic molecule
Emp. Form.C25H27NO2
Mol. Mass.373.4874
SMILESCOc1ccc(cc1OC1CCCC1)[C@H](Cc1ccncc1)c1ccccc1