Reaction Details
TargetcAMP-specific 3',5'-cyclic phosphodiesterase 4A
LigandBDBM50128419
Substrate/Competitorn/a
Meas. Tech.ChEMBL_155042 (CHEMBL764361)
IC50 0.600000±n/a nM
Citation Ducharme, YFriesen, RWBlouin, MCôté, BDubé, DEthier, DFrenette, RLaliberté, FMancini, JAMasson, PStyhler, AYoung, RNGirard, Y Substituted 2-pyridinemethanol derivatives as potent and selective phosphodiesterase-4 inhibitors. Bioorg Med Chem Lett13:1923-6 (2003) cAMP-specific 3',5'-cyclic phosphodiesterase 4A
Name:cAMP-specific 3',5'-cyclic phosphodiesterase 4A
Type:Enzyme
Mol. Mass.:98113.27
Organism:Homo sapiens (Human)
Description:P27815
Residue:886
BDBM50128419
NameBDBM50128419
Synonyms:1-{5-[1-(3,4-Bis-difluoromethoxy-phenyl)-2-(1-oxy-pyridin-4-yl)-ethyl]-pyridin-2-yl}-1-phenyl-ethanol | CHEMBL61191
TypeSmall organic molecule
Emp. Form.C28H24F4N2O4
Mol. Mass.528.4948
SMILESCC(O)(c1ccccc1)c1ccc(cn1)C(Cc1cc[n+]([O-])cc1)c1ccc(OC(F)F)c(OC(F)F)c1