Reaction Details
TargetDihydrofolate reductase
LigandBDBM50128540
Substrate/Competitorn/a
Meas. Tech.ChEMBL_53156 (CHEMBL665665)
IC50 4±n/a nM
Citation Wyss, PCGerber, PHartman, PGHubschwerlen, CLocher, HMarty, HPStahl, M Novel dihydrofolate reductase inhibitors. Structure-based versus diversity-based library design and high-throughput synthesis and screening. J Med Chem46:2304-12 (2003) 
 
Dihydrofolate reductase
Name:Dihydrofolate reductase
Type:Enzyme
Mol. Mass.:21453.99
Organism:Homo sapiens (Human)
Description:Recombinant human DHFR.
Residue:187
BDBM50128540
NameBDBM50128540
Synonyms:5-(1,3,4,9-Tetrahydro-beta-carbolin-2-ylmethyl)-pyrimidine-2,4-diamine | CHEMBL75944
TypeSmall organic molecule
Emp. Form.C16H18N6
Mol. Mass.294.3543
SMILESNc1ncc(CN2CCc3c(C2)[nH]c2ccccc32)c(N)n1