Reaction Details
TargetCalpain-1 catalytic subunit
LigandBDBM50128678
Substrate/Competitorn/a
Meas. Tech.ChEMBL_43669 (CHEMBL656202)
Ki 8.4±n/a nM
Citation Lubisch, WBeckenbach, EBopp, SHofmann, HPKartal, AKästel, CLindner, TMetz-Garrecht, MReeb, JRegner, FVierling, MMöller, A Benzoylalanine-derived ketoamides carrying vinylbenzyl amino residues: discovery of potent water-soluble calpain inhibitors with oral bioavailability. J Med Chem46:2404-12 (2003) 
 
Calpain-1 catalytic subunit
Name:Calpain-1 catalytic subunit
Type:Protein
Mol. Mass.:81880.51
Organism:Homo sapiens (Human)
Description:n/a
Residue:714
BDBM50128678
NameBDBM50128678
Synonyms:CHEMBL310855 | N-(1-Carbamoyl-2-phenyl-ethyl)-2-(2-naphthalen-1-yl-vinyl)-benzamide
TypeSmall organic molecule
Emp. Form.C28H24N2O2
Mol. Mass.420.5024
SMILESNC(=O)C(Cc1ccccc1)NC(=O)c1ccccc1\C=C\c1cccc2ccccc12