Reaction Details
TargetCalpain-1 catalytic subunit
LigandBDBM50073850
Substrate/Competitorn/a
Meas. Tech.ChEMBL_43654 (CHEMBL654080)
IC50 700±n/a nM
Citation Lubisch, WBeckenbach, EBopp, SHofmann, HPKartal, AKästel, CLindner, TMetz-Garrecht, MReeb, JRegner, FVierling, MMöller, A Benzoylalanine-derived ketoamides carrying vinylbenzyl amino residues: discovery of potent water-soluble calpain inhibitors with oral bioavailability. J Med Chem46:2404-12 (2003) 
 
Calpain-1 catalytic subunit
Name:Calpain-1 catalytic subunit
Type:Protein
Mol. Mass.:81880.51
Organism:Homo sapiens (Human)
Description:n/a
Residue:714
BDBM50073850
NameBDBM50073850
Synonyms:(S)-2-((S)-2-Benzyloxycarbonylamino-3-methyl-butyrylamino)-3-phenyl-propionic acid MDL-28170 [1-(1-Benzyl-2-oxo-ethylcarbamoyl)-2-methyl-propyl]-carbamic acid benzyl ester benzyl (2S)-3-methyl-1-oxo-1-(1-oxo-3-phenylpropan-2-ylamino)butan-2-ylcarbamate | benzyl (S)-3-methyl-1-oxo-1-(1-oxo-3-phenylpropan-2-ylamino)butan-2-ylcarbamate
TypeSmall organic molecule
Emp. Form.C22H26N2O4
Mol. Mass.382.4528
SMILESCC(C)[C@H](NC(=O)OCc1ccccc1)C(=O)NC(Cc1ccccc1)C=O