Reaction Details
TargetcAMP-specific 3',5'-cyclic phosphodiesterase 4A
LigandBDBM50128689
Substrate/Competitorn/a
Meas. Tech.ChEMBL_70496 (CHEMBL677056)
IC50 55.0±n/a nM
Citation Friesen, RWDucharme, YBall, RGBlouin, MBoulet, LCôté, BFrenette, RGirard, MGuay, DHuang, ZJones, TRLaliberté, FLynch, JJMancini, JMartins, EMasson, PMuise, EPon, DJSiegl, PKStyhler, ATsou, NNTurner, MJYoung, RNGirard, Y Optimization of a tertiary alcohol series of phosphodiesterase-4 (PDE4) inhibitors: structure-activity relationship related to PDE4 inhibition and human ether-a-go-go related gene potassium channel binding affinity. J Med Chem46:2413-26 (2003) 
 
cAMP-specific 3',5'-cyclic phosphodiesterase 4A
Name:cAMP-specific 3',5'-cyclic phosphodiesterase 4A
Type:Enzyme
Mol. Mass.:98113.27
Organism:Homo sapiens (Human)
Description:P27815
Residue:886
BDBM50128689
NameBDBM50128689
Synonyms:2-{5-[1-(3-Cyclopropoxy-4-difluoromethoxy-phenyl)-2-(1-oxy-pyridin-4-yl)-ethyl]-pyridin-2-yl}-propan-2-ol | CHEMBL276559
TypeSmall organic molecule
Emp. Form.C25H26F2N2O4
Mol. Mass.456.4817
SMILESCC(C)(O)c1ccc(cn1)C(Cc1cc[n+]([O-])cc1)c1ccc(OC(F)F)c(OC2CC2)c1