Reaction Details
TargetPotassium voltage-gated channel subfamily H member 2
LigandBDBM50174020
Substrate/Competitorn/a
Meas. Tech.ChEMBL_215102 (CHEMBL820996)
Ki 61400±n/a nM
Citation Friesen, RWDucharme, YBall, RGBlouin, MBoulet, LCôté, BFrenette, RGirard, MGuay, DHuang, ZJones, TRLaliberté, FLynch, JJMancini, JMartins, EMasson, PMuise, EPon, DJSiegl, PKStyhler, ATsou, NNTurner, MJYoung, RNGirard, Y Optimization of a tertiary alcohol series of phosphodiesterase-4 (PDE4) inhibitors: structure-activity relationship related to PDE4 inhibition and human ether-a-go-go related gene potassium channel binding affinity. J Med Chem46:2413-26 (2003) 
 
Potassium voltage-gated channel subfamily H member 2
Name:Potassium voltage-gated channel subfamily H member 2
Type:Multi-pass membrane protein
Mol. Mass.:126672.65
Organism:Homo sapiens (Human)
Description:Q12809
Residue:1159
BDBM50174020
NameBDBM50174020
Synonyms:(S)-(+)-3-{2-[(3-Cyclopropyloxy-4-difluromethoxy)-phenyl]-2-[5-(2-(1-hydroxy-1-trifluoromethyl-2,2,2-trifluoro)ethyl)-thiazolyl]ethyl}pyridine N-Oxide CHEMBL199015 | L-869298
TypeSmall organic molecule
Emp. Form.C23H18F8N2O4S
Mol. Mass.570.452
SMILESOC(c1ncc(s1)[C@@H](Cc1ccc[n+]([O-])c1)c1ccc(OC(F)F)c(OC2CC2)c1)(C(F)(F)F)C(F)(F)F