Reaction Details
TargetSodium channel protein type 4 subunit alpha
LigandBDBM50044140
Substrate/Competitorn/a
Meas. Tech.ChEMBL_143969 (CHEMBL752560)
IC50 2300000±n/a nM
Citation Choudhury-Mukherjee, ISchenck, HACechova, SPajewski, TNKapur, JEllena, JCafiso, DSBrown, ML Design, synthesis, and evaluation of analogues of 3,3,3-trifluoro-2-hydroxy-2-phenyl-propionamide as orally available general anesthetics. J Med Chem46:2494-501 (2003) 
 
Sodium channel protein type 4 subunit alpha
Name:Sodium channel protein type 4 subunit alpha
Type:Protein
Mol. Mass.:208010.01
Organism:Homo sapiens (Human)
Description:P35499
Residue:1836
BDBM50044140
NameBDBM50044140
Synonyms:2-(2-Chloro-phenyl)-2-methylamino-cyclohexanone CHEMBL742 Ketalar
TypeSmall organic molecule
Emp. Form.C13H16ClNO
Mol. Mass.237.725
SMILESCNC1(CCCCC1=O)c1ccccc1Cl