Reaction Details
TargetHypoxanthine-guanine phosphoribosyltransferase
LigandBDBM50128865
Substrate/Competitorn/a
Meas. Tech.ChEMBL_90368 (CHEMBL697044)
Ki 6700±n/a nM
Citation Medrano, FJWenck, MAEngel, JCCraig, SP Analysis of 6-(2,2-Dichloroacetamido)chrysene interaction with the hypoxanthine phosphoribosyltransferase from Trypanosoma cruzi. J Med Chem46:2548-50 (2003) 
 
Hypoxanthine-guanine phosphoribosyltransferase
Name:Hypoxanthine-guanine phosphoribosyltransferase
Type:Protein
Mol. Mass.:24579.61
Organism:Homo sapiens (Human)
Description:P00492
Residue:218
BDBM50128865
NameBDBM50128865
Synonyms:6-Nitro-chrysene | CHEMBL82858
TypeSmall organic molecule
Emp. Form.C18H11NO2
Mol. Mass.273.2854
SMILES[O-][N+](=O)c1cc2c3ccccc3ccc2c2ccccc12