Reaction Details
TargetHypoxanthine-guanine phosphoribosyltransferase
LigandBDBM50128870
Substrate/Competitorn/a
Meas. Tech.ChEMBL_90368 (CHEMBL697044)
Ki 8980±n/a nM
Citation Medrano, FJWenck, MAEngel, JCCraig, SP Analysis of 6-(2,2-Dichloroacetamido)chrysene interaction with the hypoxanthine phosphoribosyltransferase from Trypanosoma cruzi. J Med Chem46:2548-50 (2003) 
 
Hypoxanthine-guanine phosphoribosyltransferase
Name:Hypoxanthine-guanine phosphoribosyltransferase
Type:Protein
Mol. Mass.:24579.61
Organism:Homo sapiens (Human)
Description:P00492
Residue:218
BDBM50128870
NameBDBM50128870
Synonyms:CHEMBL85685 | chrysene
TypeSmall organic molecule
Emp. Form.C18H12
Mol. Mass.228.2879
SMILESc1ccc2c(c1)ccc1c3ccccc3ccc21