Reaction Details
TargetHypoxanthine-guanine phosphoribosyltransferase
LigandBDBM50128869
Substrate/Competitorn/a
Meas. Tech.ChEMBL_90369 (CHEMBL697045)
Ki>25000±n/a nM
Citation Medrano, FJWenck, MAEngel, JCCraig, SP Analysis of 6-(2,2-Dichloroacetamido)chrysene interaction with the hypoxanthine phosphoribosyltransferase from Trypanosoma cruzi. J Med Chem46:2548-50 (2003) 
 
Hypoxanthine-guanine phosphoribosyltransferase
Name:Hypoxanthine-guanine phosphoribosyltransferase
Type:Protein
Mol. Mass.:24579.61
Organism:Homo sapiens (Human)
Description:P00492
Residue:218
BDBM50128869
NameBDBM50128869
Synonyms:2,2-Dichloro-N-chrysen-6-yl-acetamide | CHEMBL88057
TypeSmall organic molecule
Emp. Form.C20H13Cl2NO
Mol. Mass.354.229
SMILESClC(Cl)C(=O)Nc1cc2c3ccccc3ccc2c2ccccc12