Reaction Details
TargetHypoxanthine-guanine phosphoribosyltransferase
LigandBDBM50128868
Substrate/Competitorn/a
Meas. Tech.ChEMBL_90370 (CHEMBL697046)
Ki 28800±n/a nM
Citation Medrano, FJWenck, MAEngel, JCCraig, SP Analysis of 6-(2,2-Dichloroacetamido)chrysene interaction with the hypoxanthine phosphoribosyltransferase from Trypanosoma cruzi. J Med Chem46:2548-50 (2003) 
 
Hypoxanthine-guanine phosphoribosyltransferase
Name:Hypoxanthine-guanine phosphoribosyltransferase
Type:Protein
Mol. Mass.:24579.61
Organism:Homo sapiens (Human)
Description:P00492
Residue:218
BDBM50128868
NameBDBM50128868
Synonyms:5-(2,4-Dichloro-phenoxy)-3-(2-fluoro-phenyl)-[1,2,4]triazolo[4,3-c]quinazoline | CHEMBL83231
TypeSmall organic molecule
Emp. Form.C21H11Cl2FN4O
Mol. Mass.425.243
SMILESFc1ccccc1-c1nnc2c3ccccc3nc(Oc3ccc(Cl)cc3Cl)n12