Reaction Details
TargetCannabinoid receptor 1
LigandBDBM50128912
Substrate/Competitorn/a
Meas. Tech.ChEBML_46648
Ki>10000±n/a nM
Citation El Fangour, SBalas, LRossi, JCFedenyuk, AGretskaya, NBobrov, MBezuglov, VHillard, CJDurand, T Hemisynthesis and preliminary evaluation of novel endocannabinoid analogues. Bioorg Med Chem Lett13:1977-80 (2003) Cannabinoid receptor 1
Name:Cannabinoid receptor 1
Type:G Protein-Coupled Receptor (GPCR)
Mol. Mass.:52856.55
Organism:Rattus norvegicus (rat)
Description:P20272
Residue:473
BDBM50128912
NameBDBM50128912
Synonyms:(5Z,8Z,11Z)-2,2-Dimethyl-icosa-5,8,11,14-tetraenoic acid 2-hydroxy-ethyl ester | CHEMBL58071
TypeSmall organic molecule
Emp. Form.C24H40O3
Mol. Mass.376.5726
SMILESCCCCC\C=C/C\C=C/C\C=C/C\C=C/CCC(C)(C)C(=O)OCCO