Reaction Details
TargetNeuropeptide Y receptor type 5
LigandBDBM50128927
Substrate/Competitorn/a
Meas. Tech.ChEBML_144128
Ki 0.840000±n/a nM
Citation Hammond, MElliott, RLGillaspy, MLHager, DCHank, RFLaFlamme, JAOliver, RMDaSilva-Jardine, PAStevenson, RWMack, CMCassella, JV Structure-activity relationships in a series of NPY Y5 antagonists: 3-amido-9-ethylcarbazoles, core-modified analogues and amide isosteres. Bioorg Med Chem Lett13:1989-92 (2003) Neuropeptide Y receptor type 5
Name:Neuropeptide Y receptor type 5
Type:Enzyme
Mol. Mass.:50746.64
Organism:Homo sapiens (Human)
Description:Q15761
Residue:445
BDBM50128927
NameBDBM50128927
Synonyms:CHEMBL59680 | N-(9-Ethyl-9H-carbazol-3-yl)-3-morpholin-4-yl-propionamide
TypeSmall organic molecule
Emp. Form.C21H25N3O2
Mol. Mass.351.4421
SMILESCCn1c2ccccc2c2cc(NC(=O)CCN3CCOCC3)ccc12