Reaction Details
TargetNeuropeptide Y receptor type 5
LigandBDBM50128928
Substrate/Competitorn/a
Meas. Tech.ChEBML_144128
Ki 3.4±n/a nM
Citation Hammond, MElliott, RLGillaspy, MLHager, DCHank, RFLaFlamme, JAOliver, RMDaSilva-Jardine, PAStevenson, RWMack, CMCassella, JV Structure-activity relationships in a series of NPY Y5 antagonists: 3-amido-9-ethylcarbazoles, core-modified analogues and amide isosteres. Bioorg Med Chem Lett13:1989-92 (2003) Neuropeptide Y receptor type 5
Name:Neuropeptide Y receptor type 5
Type:Enzyme
Mol. Mass.:50746.64
Organism:Homo sapiens (Human)
Description:Q15761
Residue:445
BDBM50128928
NameBDBM50128928
Synonyms:CHEMBL301638 | N-(9-Isopropyl-9H-carbazol-3-yl)-3-pyrrolidin-1-yl-propionamide
TypeSmall organic molecule
Emp. Form.C22H27N3O
Mol. Mass.349.4693
SMILESCC(C)n1c2ccccc2c2cc(NC(=O)CCN3CCCC3)ccc12