Reaction Details
TargetNeuropeptide Y receptor type 5
LigandBDBM50128929
Substrate/Competitorn/a
Meas. Tech.ChEBML_144128
Ki 14±n/a nM
Citation Hammond, MElliott, RLGillaspy, MLHager, DCHank, RFLaFlamme, JAOliver, RMDaSilva-Jardine, PAStevenson, RWMack, CMCassella, JV Structure-activity relationships in a series of NPY Y5 antagonists: 3-amido-9-ethylcarbazoles, core-modified analogues and amide isosteres. Bioorg Med Chem Lett13:1989-92 (2003) Neuropeptide Y receptor type 5
Name:Neuropeptide Y receptor type 5
Type:Enzyme
Mol. Mass.:50746.64
Organism:Homo sapiens (Human)
Description:Q15761
Residue:445
BDBM50128929
NameBDBM50128929
Synonyms:CHEMBL61879 | N-(9-Ethyl-9H-carbazol-3-yl)-2,2,2-trifluoro-acetamide
TypeSmall organic molecule
Emp. Form.C16H13F3N2O
Mol. Mass.306.2824
SMILESCCn1c2ccccc2c2cc(NC(=O)C(F)(F)F)ccc12