Reaction Details
TargetNeuropeptide Y receptor type 5
LigandBDBM50128932
Substrate/Competitorn/a
Meas. Tech.ChEBML_144128
Ki 15±n/a nM
Citation Hammond, MElliott, RLGillaspy, MLHager, DCHank, RFLaFlamme, JAOliver, RMDaSilva-Jardine, PAStevenson, RWMack, CMCassella, JV Structure-activity relationships in a series of NPY Y5 antagonists: 3-amido-9-ethylcarbazoles, core-modified analogues and amide isosteres. Bioorg Med Chem Lett13:1989-92 (2003) Neuropeptide Y receptor type 5
Name:Neuropeptide Y receptor type 5
Type:Enzyme
Mol. Mass.:50746.64
Organism:Homo sapiens (Human)
Description:Q15761
Residue:445
BDBM50128932
NameBDBM50128932
Synonyms:9-Ethyl-3-(4-methyl-5-phenyl-1H-imidazol-2-yl)-9H-carbazole | CHEMBL303325
TypeSmall organic molecule
Emp. Form.C24H21N3
Mol. Mass.351.4436
SMILESCCn1c2ccccc2c2cc(ccc12)-c1nc(c(C)[nH]1)-c1ccccc1