Reaction Details
TargetNeuropeptide Y receptor type 5
LigandBDBM50128933
Substrate/Competitorn/a
Meas. Tech.ChEBML_144128
Ki 21±n/a nM
Citation Hammond, MElliott, RLGillaspy, MLHager, DCHank, RFLaFlamme, JAOliver, RMDaSilva-Jardine, PAStevenson, RWMack, CMCassella, JV Structure-activity relationships in a series of NPY Y5 antagonists: 3-amido-9-ethylcarbazoles, core-modified analogues and amide isosteres. Bioorg Med Chem Lett13:1989-92 (2003) Neuropeptide Y receptor type 5
Name:Neuropeptide Y receptor type 5
Type:Enzyme
Mol. Mass.:50746.64
Organism:Homo sapiens (Human)
Description:Q15761
Residue:445
BDBM50128933
NameBDBM50128933
Synonyms:2-Dimethylamino-N-(9-ethyl-9H-carbazol-3-yl)-acetamide | CHEMBL294286
TypeSmall organic molecule
Emp. Form.C18H21N3O
Mol. Mass.295.3788
SMILESCCn1c2ccccc2c2cc(NC(=O)CN(C)C)ccc12