Reaction Details
TargetNeuropeptide Y receptor type 5
LigandBDBM50128938
Substrate/Competitorn/a
Meas. Tech.ChEBML_144128
Ki 2.6±n/a nM
Citation Hammond, MElliott, RLGillaspy, MLHager, DCHank, RFLaFlamme, JAOliver, RMDaSilva-Jardine, PAStevenson, RWMack, CMCassella, JV Structure-activity relationships in a series of NPY Y5 antagonists: 3-amido-9-ethylcarbazoles, core-modified analogues and amide isosteres. Bioorg Med Chem Lett13:1989-92 (2003) Neuropeptide Y receptor type 5
Name:Neuropeptide Y receptor type 5
Type:Enzyme
Mol. Mass.:50746.64
Organism:Homo sapiens (Human)
Description:Q15761
Residue:445
BDBM50128938
NameBDBM50128938
Synonyms:2-Benzylamino-N-(9-ethyl-9H-carbazol-3-yl)-acetamide | CHEMBL58424
TypeSmall organic molecule
Emp. Form.C23H23N3O
Mol. Mass.357.4482
SMILESCCn1c2ccccc2c2cc(NC(=O)CNCc3ccccc3)ccc12