Reaction Details
TargetNeuropeptide Y receptor type 5
LigandBDBM50128942
Substrate/Competitorn/a
Meas. Tech.ChEBML_144128
Ki 16±n/a nM
Citation Hammond, MElliott, RLGillaspy, MLHager, DCHank, RFLaFlamme, JAOliver, RMDaSilva-Jardine, PAStevenson, RWMack, CMCassella, JV Structure-activity relationships in a series of NPY Y5 antagonists: 3-amido-9-ethylcarbazoles, core-modified analogues and amide isosteres. Bioorg Med Chem Lett13:1989-92 (2003) Neuropeptide Y receptor type 5
Name:Neuropeptide Y receptor type 5
Type:Enzyme
Mol. Mass.:50746.64
Organism:Homo sapiens (Human)
Description:Q15761
Residue:445
BDBM50128942
NameBDBM50128942
Synonyms:CHEMBL59866 | N-(5-Isopropyl-6-oxo-5,6-dihydro-phenanthridin-9-yl)-2-pyridin-4-yl-acetamide
TypeSmall organic molecule
Emp. Form.C23H21N3O2
Mol. Mass.371.4317
SMILESCC(C)n1c2ccccc2c2cc(NC(=O)Cc3ccncc3)ccc2c1=O