Reaction Details
TargetNeuropeptide Y receptor type 5
LigandBDBM50128946
Substrate/Competitorn/a
Meas. Tech.ChEBML_144128
Ki 43±n/a nM
Citation Hammond, MElliott, RLGillaspy, MLHager, DCHank, RFLaFlamme, JAOliver, RMDaSilva-Jardine, PAStevenson, RWMack, CMCassella, JV Structure-activity relationships in a series of NPY Y5 antagonists: 3-amido-9-ethylcarbazoles, core-modified analogues and amide isosteres. Bioorg Med Chem Lett13:1989-92 (2003) Neuropeptide Y receptor type 5
Name:Neuropeptide Y receptor type 5
Type:Enzyme
Mol. Mass.:50746.64
Organism:Homo sapiens (Human)
Description:Q15761
Residue:445
BDBM50128946
NameBDBM50128946
Synonyms:CHEMBL292560 | N-(5-Ethyl-6-oxo-5,6-dihydro-phenanthridin-9-yl)-2,2,2-trifluoro-acetamide
TypeSmall organic molecule
Emp. Form.C17H13F3N2O2
Mol. Mass.334.2925
SMILESCCn1c2ccccc2c2cc(NC(=O)C(F)(F)F)ccc2c1=O