Reaction Details
TargetGlutamate carboxypeptidase 2
LigandBDBM50129197
Substrate/Competitorn/a
Meas. Tech.ChEBML_71704
IC50 43000±n/a nM
Citation Stoermer, DLiu, QHall, MRFlanary, JMThomas, AGRojas, CSlusher, BSTsukamoto, T Synthesis and biological evaluation of hydroxamate-Based inhibitors of glutamate carboxypeptidase II. Bioorg Med Chem Lett13:2097-100 (2003) Glutamate carboxypeptidase 2
Name:Glutamate carboxypeptidase 2
Type:PROTEIN
Mol. Mass.:84333.66
Organism:Homo sapiens (Human)
Description:ChEMBL_1497035
Residue:750
BDBM50129197
NameBDBM50129197
Synonyms:4-(Hydroxyamino)-4-oxobutanoic acid N-Hydroxy-succinamic acid
TypeSmall organic molecule
Emp. Form.C4H7NO4
Mol. Mass.133.1027
SMILESONC(=O)CCC(O)=O