Reaction Details
TargetBacterial leucyl aminopeptidase
LigandBDBM50129200
Substrate/Competitorn/a
Meas. Tech.ChEBML_98920
Ki 2±n/a nM
Citation Stoermer, DLiu, QHall, MRFlanary, JMThomas, AGRojas, CSlusher, BSTsukamoto, T Synthesis and biological evaluation of hydroxamate-Based inhibitors of glutamate carboxypeptidase II. Bioorg Med Chem Lett13:2097-100 (2003) Bacterial leucyl aminopeptidase
Name:Bacterial leucyl aminopeptidase
Type:PROTEIN
Mol. Mass.:54213.72
Organism:Vibrio proteolyticus
Description:ChEMBL_1507540
Residue:504
BDBM50129200
NameBDBM50129200
Synonyms:(R)-2-Amino-4-methyl-pentanoic acid hydroxyamide | CHEMBL63231
TypeSmall organic molecule
Emp. Form.C6H14N2O2
Mol. Mass.146.1876
SMILESCC(C)C[C@@H](N)C(=O)NO