Reaction Details
TargetBone morphogenetic protein 1
LigandBDBM50129215
Substrate/Competitorn/a
Meas. Tech.ChEBML_158890
Ki 250±n/a nM
Citation Delaet, NGRobinson, LAWilson, DMSullivan, RWBradley, EKDankwardt, SMMartin, RLVan Wart, HEWalker, KA Novel inhibitors of procollagen C-terminal proteinase. Part 1: diamino Acid hydroxamates. Bioorg Med Chem Lett13:2101-4 (2003) Bone morphogenetic protein 1
Name:Bone morphogenetic protein 1
Type:PROTEIN
Mol. Mass.:111254.03
Organism:Homo sapiens (Human)
Description:ChEMBL_518962
Residue:986
BDBM50129215
NameBDBM50129215
Synonyms:2-[Benzo[1,3]dioxol-5-ylmethyl-((R)-4-methoxy-benzenesulfonyl)-amino]-N-hydroxy-3-[2-(pyrazin-2-ylamino)-acetylamino]-propionamide | CHEMBL63242
TypeSmall organic molecule
Emp. Form.C24H26N6O8S
Mol. Mass.558.564
SMILESCOc1ccc(cc1)S(=O)(=O)N(Cc1ccc2OCOc2c1)[C@H](CNC(=O)CNc1cnccn1)C(=O)NO