Reaction Details
TargetHistamine H3 receptor
LigandBDBM50129254
Substrate/Competitorn/a
Meas. Tech.ChEMBL_83650 (CHEMBL693110)
Ki 80±n/a nM
Citation Turner, SCEsbenshade, TABennani, YLHancock, AA A new class of histamine H(3)-receptor antagonists: synthesis and structure-activity relationships of 7,8,9,10-tetrahydro-6H-cyclohepta[b]quinolines. Bioorg Med Chem Lett13:2131-5 (2003) Histamine H3 receptor
Name:Histamine H3 receptor
Type:G Protein-Coupled Receptor (GPCR)
Mol. Mass.:48691.47
Organism:Homo sapiens (Human)
Description:Binding assays were using CHO cells stably expressing hH3R receptors.
Residue:445
BDBM50129254
NameBDBM50129254
Synonyms:CHEMBL303824 | [2-(1-Methyl-pyrrolidin-2-yl)-ethyl]-(7,8,9,10-tetrahydro-6H-cyclohepta[b]quinolin-11-yl)-amine
TypeSmall organic molecule
Emp. Form.C21H29N3
Mol. Mass.323.4751
SMILESCN1CCCC1CCNc1c2CCCCCc2nc2ccccc12