Reaction Details
TargetHistamine H3 receptor
LigandBDBM50129253
Substrate/Competitorn/a
Meas. Tech.ChEMBL_83650 (CHEMBL693110)
Ki 6.6±n/a nM
Citation Turner, SCEsbenshade, TABennani, YLHancock, AA A new class of histamine H(3)-receptor antagonists: synthesis and structure-activity relationships of 7,8,9,10-tetrahydro-6H-cyclohepta[b]quinolines. Bioorg Med Chem Lett13:2131-5 (2003) Histamine H3 receptor
Name:Histamine H3 receptor
Type:G Protein-Coupled Receptor (GPCR)
Mol. Mass.:48691.47
Organism:Homo sapiens (Human)
Description:Binding assays were using CHO cells stably expressing hH3R receptors.
Residue:445
BDBM50129253
NameBDBM50129253
Synonyms:(3-Pyrrolidin-1-yl-propyl)-(7,8,9,10-tetrahydro-6H-cyclohepta[b]quinolin-11-yl)-amine | CHEMBL66388
TypeSmall organic molecule
Emp. Form.C21H29N3
Mol. Mass.323.4751
SMILESC(CNc1c2CCCCCc2nc2ccccc12)CN1CCCC1