Reaction Details
TargetHistamine H3 receptor
LigandBDBM50220972
Substrate/Competitorn/a
Meas. Tech.ChEMBL_87057 (CHEMBL697959)
Ki 617±n/a nM
Citation Turner, SCEsbenshade, TABennani, YLHancock, AA A new class of histamine H(3)-receptor antagonists: synthesis and structure-activity relationships of 7,8,9,10-tetrahydro-6H-cyclohepta[b]quinolines. Bioorg Med Chem Lett13:2131-5 (2003) Histamine H3 receptor
Name:Histamine H3 receptor
Type:G Protein-Coupled Receptor (GPCR)
Mol. Mass.:48607.98
Organism:Rattus norvegicus (rat)
Description:n/a
Residue:445
BDBM50220972
NameBDBM50220972
Synonyms:CHEMBL304737
TypeSmall organic molecule
Emp. Form.C23H28N2O
Mol. Mass.348.4812
SMILESOC[C@@H]1CCN(CCC#Cc2c3CCCCCc3nc3ccccc23)C1