Reaction Details
TargetHistamine H3 receptor
LigandBDBM50220956
Substrate/Competitorn/a
Meas. Tech.ChEMBL_83801 (CHEMBL692577)
Ki 158±n/a nM
Citation Turner, SCEsbenshade, TABennani, YLHancock, AA A new class of histamine H(3)-receptor antagonists: synthesis and structure-activity relationships of 7,8,9,10-tetrahydro-6H-cyclohepta[b]quinolines. Bioorg Med Chem Lett13:2131-5 (2003) Histamine H3 receptor
Name:Histamine H3 receptor
Type:G Protein-Coupled Receptor (GPCR)
Mol. Mass.:48691.47
Organism:Homo sapiens (Human)
Description:Binding assays were using CHO cells stably expressing hH3R receptors.
Residue:445
BDBM50220956
NameBDBM50220956
Synonyms:CHEMBL69752
TypeSmall organic molecule
Emp. Form.C24H30N2
Mol. Mass.346.5084
SMILESC(CN1CCCCC1)C#Cc1c2CCCCCCc2nc2ccccc12