Reaction Details
TargetHistamine H3 receptor
LigandBDBM50220950
Substrate/Competitorn/a
Meas. Tech.ChEMBL_87057 (CHEMBL697959)
Ki 398±n/a nM
Citation Turner, SCEsbenshade, TABennani, YLHancock, AA A new class of histamine H(3)-receptor antagonists: synthesis and structure-activity relationships of 7,8,9,10-tetrahydro-6H-cyclohepta[b]quinolines. Bioorg Med Chem Lett13:2131-5 (2003) Histamine H3 receptor
Name:Histamine H3 receptor
Type:G Protein-Coupled Receptor (GPCR)
Mol. Mass.:48607.98
Organism:Rattus norvegicus (rat)
Description:n/a
Residue:445
BDBM50220950
NameBDBM50220950
Synonyms:CHEMBL67496
TypeSmall organic molecule
Emp. Form.C21H29N3O
Mol. Mass.339.4745
SMILESC(CNc1c2CCCCCc2nc2ccccc12)CN1CCOCC1