Reaction Details
TargetHistamine H3 receptor
LigandBDBM50220976
Substrate/Competitorn/a
Meas. Tech.ChEMBL_83801 (CHEMBL692577)
Ki 54±n/a nM
Citation Turner, SCEsbenshade, TABennani, YLHancock, AA A new class of histamine H(3)-receptor antagonists: synthesis and structure-activity relationships of 7,8,9,10-tetrahydro-6H-cyclohepta[b]quinolines. Bioorg Med Chem Lett13:2131-5 (2003) Histamine H3 receptor
Name:Histamine H3 receptor
Type:G Protein-Coupled Receptor (GPCR)
Mol. Mass.:48691.47
Organism:Homo sapiens (Human)
Description:Binding assays were using CHO cells stably expressing hH3R receptors.
Residue:445
BDBM50220976
NameBDBM50220976
Synonyms:CHEMBL419993
TypeSmall organic molecule
Emp. Form.C17H23N3S
Mol. Mass.301.45
SMILESCN(C)CCCNc1c2CSCCc2nc2ccccc12