Reaction Details
TargetHistamine H3 receptor
LigandBDBM50220977
Substrate/Competitorn/a
Meas. Tech.ChEMBL_87057 (CHEMBL697959)
Ki 74±n/a nM
Citation Turner, SCEsbenshade, TABennani, YLHancock, AA A new class of histamine H(3)-receptor antagonists: synthesis and structure-activity relationships of 7,8,9,10-tetrahydro-6H-cyclohepta[b]quinolines. Bioorg Med Chem Lett13:2131-5 (2003) Histamine H3 receptor
Name:Histamine H3 receptor
Type:G Protein-Coupled Receptor (GPCR)
Mol. Mass.:48607.98
Organism:Rattus norvegicus (rat)
Description:n/a
Residue:445
BDBM50220977
NameBDBM50220977
Synonyms:CHEMBL68547
TypeSmall organic molecule
Emp. Form.C22H30N4
Mol. Mass.350.5004
SMILES[H][C@@]12CN(CCCNc3c4CCCCCc4nc4ccccc34)C[C@]1([H])[C@H]2N