Reaction Details
TargetHistamine H3 receptor
LigandBDBM50129256
Substrate/Competitorn/a
Meas. Tech.ChEMBL_83650 (CHEMBL693110)
Ki 1.7±n/a nM
Citation Turner, SCEsbenshade, TABennani, YLHancock, AA A new class of histamine H(3)-receptor antagonists: synthesis and structure-activity relationships of 7,8,9,10-tetrahydro-6H-cyclohepta[b]quinolines. Bioorg Med Chem Lett13:2131-5 (2003) Histamine H3 receptor
Name:Histamine H3 receptor
Type:G Protein-Coupled Receptor (GPCR)
Mol. Mass.:48691.47
Organism:Homo sapiens (Human)
Description:Binding assays were using CHO cells stably expressing hH3R receptors.
Residue:445
BDBM50129256
NameBDBM50129256
Synonyms:11-(4-Piperidin-1-yl-but-1-ynyl)-7,8,9,10-tetrahydro-6H-cyclohepta[b]quinoline | CHEMBL66660
TypeSmall organic molecule
Emp. Form.C23H28N2
Mol. Mass.332.4818
SMILESC(CN1CCCCC1)C#Cc1c2CCCCCc2nc2ccccc12