Reaction Details
TargetMuscarinic acetylcholine receptor M3
LigandBDBM50129396
Substrate/Competitorn/a
Meas. Tech.ChEBML_138705
Ki 93±n/a nM
Citation Ogino, YOhtake, NKobayashi, KKimura, TFujikawa, THasegawa, TNoguchi, KMase, T Muscarinic M(3) receptor antagonists with (2R)-2-[(1R)-3,3-difluorocyclopentyl]-2-hydroxyphenylacetamide Structures. Part 2. Bioorg Med Chem Lett13:2167-72 (2003) Muscarinic acetylcholine receptor M3
Name:Muscarinic acetylcholine receptor M3
Type:Enzyme
Mol. Mass.:66151.03
Organism:Homo sapiens (Human)
Description:P20309
Residue:590
BDBM50129396
NameBDBM50129396
Synonyms:(R)-N-(3-Aminomethyl-phenyl)-2-((R)-3,3-difluoro-cyclopentyl)-2-hydroxy-2-phenyl-acetamide | CHEMBL302145
TypeSmall organic molecule
Emp. Form.C20H22F2N2O2
Mol. Mass.360.3977
SMILESNCc1cccc(NC(=O)[C@@](O)([C@@H]2CCC(F)(F)C2)c2ccccc2)c1