Reaction Details
TargetMuscarinic acetylcholine receptor M1
LigandBDBM50129399
Substrate/Competitorn/a
Meas. Tech.ChEBML_138407
Ki 2.1±n/a nM
Citation Ogino, YOhtake, NKobayashi, KKimura, TFujikawa, THasegawa, TNoguchi, KMase, T Muscarinic M(3) receptor antagonists with (2R)-2-[(1R)-3,3-difluorocyclopentyl]-2-hydroxyphenylacetamide Structures. Part 2. Bioorg Med Chem Lett13:2167-72 (2003) Muscarinic acetylcholine receptor M1
Name:Muscarinic acetylcholine receptor M1
Type:Protein
Mol. Mass.:51442.54
Organism:Homo sapiens (Human)
Description:P11229
Residue:460
BDBM50129399
NameBDBM50129399
Synonyms:(R)-1-[4-(2-Amino-ethyl)-piperidin-1-yl]-2-cyclopentyl-2-hydroxy-2-phenyl-ethanone | CHEMBL69648
TypeSmall organic molecule
Emp. Form.C20H30N2O2
Mol. Mass.330.4644
SMILESNCCC1CCN(CC1)C(=O)[C@@](O)(C1CCCC1)c1ccccc1