Reaction Details
TargetMuscarinic acetylcholine receptor M1
LigandBDBM50095657
Substrate/Competitorn/a
Meas. Tech.ChEBML_138407
Ki 1.5±n/a nM
Citation Ogino, YOhtake, NKobayashi, KKimura, TFujikawa, THasegawa, TNoguchi, KMase, T Muscarinic M(3) receptor antagonists with (2R)-2-[(1R)-3,3-difluorocyclopentyl]-2-hydroxyphenylacetamide Structures. Part 2. Bioorg Med Chem Lett13:2167-72 (2003) Muscarinic acetylcholine receptor M1
Name:Muscarinic acetylcholine receptor M1
Type:Protein
Mol. Mass.:51442.54
Organism:Homo sapiens (Human)
Description:P11229
Residue:460
BDBM50095657
NameBDBM50095657
Synonyms:(R)-N-[1-(6-Amino-pyridin-2-ylmethyl)-piperidin-4-yl]-2-((R)-3,3-difluoro-cyclopentyl)-2-hydroxy-2-phenyl-acetamide N-[1-(6-Amino-pyridin-2-ylmethyl)-piperidin-4-yl]-2-(3,3-difluoro-cyclopentyl)-2-hydroxy-2-phenyl-acetamide
TypeSmall organic molecule
Emp. Form.C24H30F2N4O2
Mol. Mass.444.5174
SMILESNc1cccc(CN2CCC(CC2)NC(=O)[C@@](O)([C@@H]2CCC(F)(F)C2)c2ccccc2)n1