Reaction Details
TargetMuscarinic acetylcholine receptor M3
LigandBDBM50129397
Substrate/Competitorn/a
Meas. Tech.ChEBML_138705
Ki 3.3±n/a nM
Citation Ogino, YOhtake, NKobayashi, KKimura, TFujikawa, THasegawa, TNoguchi, KMase, T Muscarinic M(3) receptor antagonists with (2R)-2-[(1R)-3,3-difluorocyclopentyl]-2-hydroxyphenylacetamide Structures. Part 2. Bioorg Med Chem Lett13:2167-72 (2003) Muscarinic acetylcholine receptor M3
Name:Muscarinic acetylcholine receptor M3
Type:Enzyme
Mol. Mass.:66151.03
Organism:Homo sapiens (Human)
Description:P20309
Residue:590
BDBM50129397
NameBDBM50129397
Synonyms:(R)-1-[4-(2-Amino-ethyl)-4-methyl-piperidin-1-yl]-2-((R)-3,3-difluoro-cyclopentyl)-2-hydroxy-2-phenyl-ethanone | CHEMBL302809
TypeSmall organic molecule
Emp. Form.C21H30F2N2O2
Mol. Mass.380.4719
SMILESCC1(CCN)CCN(CC1)C(=O)[C@@](O)([C@@H]1CCC(F)(F)C1)c1ccccc1