Reaction Details
TargetMuscarinic acetylcholine receptor M1
LigandBDBM50129388
Substrate/Competitorn/a
Meas. Tech.ChEBML_138407
Ki 55±n/a nM
Citation Ogino, YOhtake, NKobayashi, KKimura, TFujikawa, THasegawa, TNoguchi, KMase, T Muscarinic M(3) receptor antagonists with (2R)-2-[(1R)-3,3-difluorocyclopentyl]-2-hydroxyphenylacetamide Structures. Part 2. Bioorg Med Chem Lett13:2167-72 (2003) Muscarinic acetylcholine receptor M1
Name:Muscarinic acetylcholine receptor M1
Type:Protein
Mol. Mass.:51442.54
Organism:Homo sapiens (Human)
Description:P11229
Residue:460
BDBM50129388
NameBDBM50129388
Synonyms:(R)-N-(4-Aminomethyl-cyclohexyl)-2-((R)-3,3-difluoro-cyclopentyl)-2-hydroxy-2-phenyl-acetamide | CHEMBL71799
TypeSmall organic molecule
Emp. Form.C20H28F2N2O2
Mol. Mass.366.4453
SMILESNCC1CCC(CC1)NC(=O)[C@@](O)([C@@H]1CCC(F)(F)C1)c1ccccc1