Reaction Details
TargetSubstance-K receptor
LigandBDBM50129505
Substrate/Competitorn/a
Meas. Tech.ChEBML_209018
IC50 7.5±n/a nM
Citation MacKenzie, ARMarchington, APMiddleton, DSNewman, SDSelway, CNTerrett, NK 4-Amino-2-(aryl)-butylbenzamides and Their conformationally constrained analogues. Potent antagonists of the human neurokinin-2 (NK(2)) receptor. Bioorg Med Chem Lett13:2211-5 (2003) Substance-K receptor
Name:Substance-K receptor
Type:Protein
Mol. Mass.:44455.78
Organism:Homo sapiens (Human)
Description:P21452
Residue:398
BDBM50129505
NameBDBM50129505
Synonyms:CHEMBL69889 | {3-(3,4-Dichloro-phenyl)-3-[2-(3-morpholin-4-yl-azetidin-1-yl)-ethyl]-pyrrolidin-1-yl}-phenyl-methanone
TypeSmall organic molecule
Emp. Form.C26H31Cl2N3O2
Mol. Mass.488.449
SMILESClc1ccc(cc1Cl)C1(CCN2CC(C2)N2CCOCC2)CCN(C1)C(=O)c1ccccc1