Reaction Details
TargetSubstance-K receptor
LigandBDBM50129523
Substrate/Competitorn/a
Meas. Tech.ChEBML_209018
IC50 8.9±n/a nM
Citation MacKenzie, ARMarchington, APMiddleton, DSNewman, SDSelway, CNTerrett, NK 4-Amino-2-(aryl)-butylbenzamides and Their conformationally constrained analogues. Potent antagonists of the human neurokinin-2 (NK(2)) receptor. Bioorg Med Chem Lett13:2211-5 (2003) Substance-K receptor
Name:Substance-K receptor
Type:Protein
Mol. Mass.:44455.78
Organism:Homo sapiens (Human)
Description:P21452
Residue:398
BDBM50129523
NameBDBM50129523
Synonyms:CHEMBL68440 | N-{2-(3,4-Dichloro-phenyl)-4-[4-(2-oxo-2,3-dihydro-benzoimidazol-1-yl)-piperidin-1-yl]-butyl}-N-methyl-benzamide
TypeSmall organic molecule
Emp. Form.C30H32Cl2N4O2
Mol. Mass.551.507
SMILESCN(CC(CCN1CCC(CC1)n1c2ccccc2[nH]c1=O)c1ccc(Cl)c(Cl)c1)C(=O)c1ccccc1