Reaction Details
TargetRetinoic acid receptor gamma
LigandBDBM50129717
Substrate/Competitorn/a
Meas. Tech.ChEMBL_196008 (CHEMBL797872)
Ki 10000±n/a nM
Citation Michellys, PYArdecky, RJChen, JHCrombie, DLEtgen, GJFaul, MMFaulkner, ALGrese, TAHeyman, RAKaranewsky, DSKlausing, KLeibowitz, MDLiu, SMais, DAMapes, CMMarschke, KBReifel-Miller, AOgilvie, KMRungta, DThompson, AWTyhonas, JSBoehm, MF Novel (2E,4E,6Z)-7-(2-alkoxy-3,5-dialkylbenzene)-3-methylocta-2,4,6-trienoic acid retinoid X receptor modulators are active in models of type 2 diabetes. J Med Chem46:2683-96 (2003) 
 
Retinoic acid receptor gamma
Name:Retinoic acid receptor gamma
Type:PROTEIN
Mol. Mass.:50345.43
Organism:Homo sapiens (Human)
Description:ChEMBL_1458016
Residue:454
BDBM50129717
NameBDBM50129717
Synonyms:7-(3,5-Diisopropyl-2-methoxy-phenyl)-3-methyl-octa-2,4,6-trienoic acid | CHEMBL90824
TypeSmall organic molecule
Emp. Form.C22H30O3
Mol. Mass.342.4718
SMILESCOc1c(cc(cc1\C(C)=C/C=C/C(/C)=C/C(O)=O)C(C)C)C(C)C